BDBM501289 US11021493, Example 208
SMILES CC#C[C@@H](C)Oc1cnc(cn1)C(\F)=C\c1ccc(F)c(c1)[C@]1(C)CS(=O)(=O)C(C)(C)C(N)=N1
InChI Key InChIKey=UULZRQYJOWPKGT-MHZFSLMJSA-N
Data  4 IC50
  Tab Delimited (TSV)   2D SDfile   Computed 3D by Vconf -m prep SDfile
Find this compound or compounds like it in BindingDB:
Activity Spreadsheet -- Enzyme Inhibition Constant Data from BindingDB
Found 1 hit for monomerid = 501289
TargetBeta-secretase 2(Homo sapiens (Human))
Amgen
US Patent
LigandPNGBDBM501289(US11021493, Example 208)
Affinity DataIC50:  107nM. Assay description: The cDNAs for both human recombinant BACE1 and 2 with C-terminal 6-His Tags were cloned into transient protein expression vectors, which were subsequ...
Ligand InfoPC cidPC sid
In DepthDetails US Patent